Target
D(1B) dopamine receptor
Ligand
BDBM48928
Substrate
Meas. Tech.
Allosteric Modulators of D1 Receptors: Dose-dependent Counterscreen
EC50
0.016±n/a nM
Citation
 PubChem, PC Allosteric Modulators of D1 Receptors: Dose-dependent Counterscreen PubChem Bioassay (2007)[AID] 
Target
Name:
D(1B) dopamine receptor
Synonyms:
D(5) dopamine receptor DOPAMINE D5 DRD1L2 DRD5_HUMAN | dopamine receptor D5
Type:
Protein
Mol. Mass.:
52943.41
Organism:
Homo sapiens (Human)
Description:
P21918
Residue:
477
  
Inhibitor
Name:
BDBM48928
Synonyms:
2-N-(4-chlorophenyl)-6-[(4-pyridin-2-ylpiperazin-1-yl)methyl]-1,3,5-triazine-2,4-diamine N2-(4-chlorophenyl)-6-[(4-pyridin-2-ylpiperazin-1-yl)methyl]-1,3,5-triazine-2,4-diamine SMR000047376 cid_666078
Type:
Small organic molecule
Emp. Form.:
C19H21ClN8
Mol. Mass.:
396.877
SMILES:
Nc1nc(CN2CCN(CC2)c2ccccn2)nc(Nc2ccc(Cl)cc2)n1
: