Target
D(1B) dopamine receptor
Ligand
BDBM48937
Substrate
Meas. Tech.
Allosteric Modulators of D1 Receptors: Dose-dependent Counterscreen
EC50
0.326±n/a nM
Citation
 PubChem, PC Allosteric Modulators of D1 Receptors: Dose-dependent Counterscreen PubChem Bioassay (2007)[AID] 
Target
Name:
D(1B) dopamine receptor
Synonyms:
D(5) dopamine receptor DOPAMINE D5 DRD1L2 DRD5_HUMAN | dopamine receptor D5
Type:
Protein
Mol. Mass.:
52943.41
Organism:
Homo sapiens (Human)
Description:
P21918
Residue:
477
  
Inhibitor
Name:
BDBM48937
Synonyms:
1-phenyl-5-thiazolo[3,2-a]quinazolinone 1-phenylthiazolo[3,2-a]quinazolin-5-one SMR000060585 | cid_2322434
Type:
Small organic molecule
Emp. Form.:
C16H10N2OS
Mol. Mass.:
278.328
SMILES:
O=c1nc2scc(-c3ccccc3)n2c2ccccc12
: