Target
D(1B) dopamine receptor
Ligand
BDBM48977
Substrate
Meas. Tech.
Allosteric Modulators of D1 Receptors: Dose-dependent Counterscreen
EC50
0.00836±n/a nM
Citation
 PubChem, PC Allosteric Modulators of D1 Receptors: Dose-dependent Counterscreen PubChem Bioassay (2007)[AID] 
Target
Name:
D(1B) dopamine receptor
Synonyms:
D(5) dopamine receptor DOPAMINE D5 DRD1L2 DRD5_HUMAN | dopamine receptor D5
Type:
Protein
Mol. Mass.:
52943.41
Organism:
Homo sapiens (Human)
Description:
P21918
Residue:
477
  
Inhibitor
Name:
BDBM48977
Synonyms:
2-(butan-2-ylthio)-3-methyl-5H-pyrimido[5,4-b]indol-4-one 3-methyl-2-(sec-butylthio)-5H-pyrimid[5,4-b]indol-4-one SMR000018491 | cid_3254362
Type:
Small organic molecule
Emp. Form.:
C15H17N3OS
Mol. Mass.:
287.38
SMILES:
CCC(C)Sc1nc2c3ccccc3[nH]c2c(=O)n1C
: