Target
D(1B) dopamine receptor
Ligand
BDBM48983
Substrate
Meas. Tech.
Allosteric Modulators of D1 Receptors: Dose-dependent Counterscreen
EC50
0.0335±n/a nM
Citation
 PubChem, PC Allosteric Modulators of D1 Receptors: Dose-dependent Counterscreen PubChem Bioassay (2007)[AID] 
Target
Name:
D(1B) dopamine receptor
Synonyms:
D(5) dopamine receptor DOPAMINE D5 DRD1L2 DRD5_HUMAN | dopamine receptor D5
Type:
Protein
Mol. Mass.:
52943.41
Organism:
Homo sapiens (Human)
Description:
P21918
Residue:
477
  
Inhibitor
Name:
BDBM48983
Synonyms:
2-(2-methylallylthio)-1-pyrindan-3-carbonitrile 2-(2-methylprop-2-enylthio)-6,7-dihydro-5H-cyclopenta[b]pyridine-3-carbonitrile SMR000106388 | cid_681230
Type:
Small organic molecule
Emp. Form.:
C13H14N2S
Mol. Mass.:
230.329
SMILES:
CC(=C)CSc1nc2CCCc2cc1C#N
: