Target
D(1B) dopamine receptor
Ligand
BDBM48986
Substrate
Meas. Tech.
Allosteric Modulators of D1 Receptors: Dose-dependent Counterscreen
EC50
0.0183±n/a nM
Citation
 PubChem, PC Allosteric Modulators of D1 Receptors: Dose-dependent Counterscreen PubChem Bioassay (2007)[AID] 
Target
Name:
D(1B) dopamine receptor
Synonyms:
D(5) dopamine receptor DOPAMINE D5 DRD1L2 DRD5_HUMAN | dopamine receptor D5
Type:
Protein
Mol. Mass.:
52943.41
Organism:
Homo sapiens (Human)
Description:
P21918
Residue:
477
  
Inhibitor
Name:
BDBM48986
Synonyms:
1-(2-methoxy-4-prop-2-enoxyphenyl)-1-propanone oxime MLS000111523 N-[1-(2-methoxy-4-prop-2-enoxyphenyl)propylidene]hydroxylamine cid_2908342
Type:
Small organic molecule
Emp. Form.:
C13H17NO3
Mol. Mass.:
235.279
SMILES:
CCC(N=O)c1ccc(OCC=C)cc1OC
: