Target
D(1A) dopamine receptor
Ligand
BDBM40336
Substrate
Meas. Tech.
Allosteric Modulators of D1 Receptors: Dose-dependent Assay
EC50
0.00344±n/a nM
Citation
 PubChem, PC Allosteric Modulators of D1 Receptors: Dose-dependent Assay PubChem Bioassay (2007)[AID] 
Target
Name:
D(1A) dopamine receptor
Synonyms:
DA D1 receptor DRD1 Dopamine D1 receptor Dopamine D1A
Type:
Enzyme
Mol. Mass.:
49303.43
Organism:
Homo sapiens (Human)
Description:
P21728
Residue:
446
  
Inhibitor
Name:
BDBM40336
Synonyms:
6-Amino-4-isopropyl-3-thiophen-2-yl-2,4-dihydro-pyrano[2,3-c]pyrazole-5-carbonitrile 6-amino-4-propan-2-yl-3-thiophen-2-yl-2,4-dihydropyrano[2,3-c]pyrazole-5-carbonitrile MLS000033498 cid_652353
Type:
Small organic molecule
Emp. Form.:
C14H14N4OS
Mol. Mass.:
286.352
SMILES:
CC(C)C1C(C#N)C(=N)Oc2[nH]nc(-c3cccs3)c12
: