Target
D(1A) dopamine receptor
Ligand
BDBM48934
Substrate
Meas. Tech.
Allosteric Modulators of D1 Receptors: Dose-dependent Assay
EC50
0.0048±n/a nM
Citation
 PubChem, PC Allosteric Modulators of D1 Receptors: Dose-dependent Assay PubChem Bioassay (2007)[AID] 
Target
Name:
D(1A) dopamine receptor
Synonyms:
DA D1 receptor DRD1 Dopamine D1 receptor Dopamine D1A
Type:
Enzyme
Mol. Mass.:
49303.43
Organism:
Homo sapiens (Human)
Description:
P21728
Residue:
446
  
Inhibitor
Name:
BDBM48934
Synonyms:
4-(4-bromophenyl)-4,10-dihydro-[1,3,5]triazino[1,2-a]benzimidazol-2-amine;ethanoic acid SMR000060236 acetic acid;[4-(4-bromophenyl)-4,10-dihydro-[1,3,5]triazino[1,2-a]benzimidazol-2-yl]amine | cid_5742515
Type:
Small organic molecule
Emp. Form.:
C15H12BrN5
Mol. Mass.:
342.193
SMILES:
NC1=NC(c2ccc(Br)cc2)n2c(N1)nc1ccccc21
: