Target
6-phosphofructo-2-kinase/fructose-2,6-bisphosphatase 4
Ligand
BDBM267066
Substrate
Meas. Tech.
PFKFB4 Assay
IC50
900±n/a nM
Citation
 Martinsson, JFaernegardh, KJoensson, MRingom, R Bisarylsulfonamides useful in the treatment of inflammation and cancer US Patent  US9718809 Publication Date 8/1/2017 
Target
Name:
6-phosphofructo-2-kinase/fructose-2,6-bisphosphatase 4
Synonyms:
6-phosphofructo-2-kinase/fructose-2,6-bisphosphatase 4 (PFKFB4) PFKFB4
Type:
Enzyme
Mol. Mass.:
54039.68
Organism:
Homo sapiens (Human)
Description:
Q16877
Residue:
469
  
Inhibitor
Name:
BDBM267066
Synonyms:
2-Methoxyethyl 4-({[5-chloro-4-(2,3-dihydro-1-benzofuran-5-yl)-2-thienyl]sulfonyl}amino)-2-hydroxybenzoate | US9718809, 76
Type:
Small organic molecule
Emp. Form.:
C22H20ClNO7S2
Mol. Mass.:
509.98
SMILES:
COCCOC(=O)c1ccc(NS(=O)(=O)c2cc(c(Cl)s2)-c2ccc3OCCc3c2)cc1O
: