Target
Estrogen receptor beta
Ligand
BDBM40593
Substrate
Meas. Tech.
Estrogen Receptor-beta Coactivator Binding Inhibitors ELISA Secondary Assay
IC50
23±n/a nM
Citation
 PubChem, PC Estrogen Receptor-beta Coactivator Binding Inhibitors ELISA Secondary Assay PubChem Bioassay (2008)[AID] 
Target
Name:
Estrogen receptor beta
Synonyms:
ER-beta ESR2_HUMAN Estradiol receptor beta (ERβ) Estrogen receptor (ER beta) Estrogen receptor beta (ER beta) NR3A2 estrogen beta
Type:
Protein
Mol. Mass.:
59238.43
Organism:
Homo sapiens (Human)
Description:
Q92731
Residue:
530
  
Inhibitor
Name:
BDBM40593
Synonyms:
(4-acetamidophenyl) 2-(2,4-dioxo-1,3-thiazolidin-5-yl)acetate 2-(2,4-diketothiazolidin-5-yl)acetic acid (4-acetamidophenyl) ester MLS000036950 cid_661448
Type:
Small organic molecule
Emp. Form.:
C13H12N2O5S
Mol. Mass.:
308.31
SMILES:
CC(=O)Nc1ccc(OC(=O)CC2SC(=O)NC2=O)cc1
: