Target
Estrogen receptor beta
Ligand
BDBM26608
Substrate
Meas. Tech.
Estrogen Receptor-beta Coactivator Binding Inhibitors ELISA Secondary Assay
IC50
23±n/a nM
Citation
 PubChem, PC Estrogen Receptor-beta Coactivator Binding Inhibitors ELISA Secondary Assay PubChem Bioassay (2008)[AID] 
Target
Name:
Estrogen receptor beta
Synonyms:
ER-beta ESR2_HUMAN Estradiol receptor beta (ERβ) Estrogen receptor (ER beta) Estrogen receptor beta (ER beta) NR3A2 estrogen beta
Type:
Protein
Mol. Mass.:
59238.43
Organism:
Homo sapiens (Human)
Description:
Q92731
Residue:
530
  
Inhibitor
Name:
BDBM26608
Synonyms:
3-(3,4-dimethylphenoxymethyl)furan-2-carboxylic acid furan carboxylic acid analogue, 33
Type:
Small organic molecule
Emp. Form.:
C14H14O4
Mol. Mass.:
246.2586
SMILES:
Cc1ccc(OCc2ccoc2C(O)=O)cc1C
: