Target
Transcription factor p65
Ligand
BDBM49257
Substrate
Meas. Tech.
Name: High Throughput Screen to Identify Compounds that increase expression of NF-kB in Human Neuronal Cells - Dose Response
EC50
20207±n/a nM
Citation
 PubChem, PC Name: High Throughput Screen to Identify Compounds that increase expression of NF-kB in Human Neuronal Cells - Dose Response PubChem Bioassay (2008)[AID] 
Target
Name:
Transcription factor p65
Synonyms:
NFKB3 Nuclear factor NF-kappa-B p65 subunit TF65_HUMAN | v-rel reticuloendotheliosis viral oncogene homolog A isoform 1
Type:
Enzyme
Mol. Mass.:
60211.92
Organism:
Homo sapiens (Human)
Description:
Q04206
Residue:
551
  
Inhibitor
Name:
BDBM49257
Synonyms:
MLS000089047 N-(4,5,6,7-tetrahydro-1,3-benzothiazol-2-yl)-2-thiophen-2-yl-ethanamide SMR000072004 | cid_847035
Type:
Small organic molecule
Emp. Form.:
C13H14N2OS2
Mol. Mass.:
278.393
SMILES:
O=C(Cc1cccs1)Nc1nc2CCCCc2s1
: