Target
Transcription factor p65
Ligand
BDBM49390
Substrate
Meas. Tech.
Name: High Throughput Screen to Identify Compounds that increase expression of NF-kB in Human Neuronal Cells - Dose Response
EC50
931122±n/a nM
Citation
 PubChem, PC Name: High Throughput Screen to Identify Compounds that increase expression of NF-kB in Human Neuronal Cells - Dose Response PubChem Bioassay (2008)[AID] 
Target
Name:
Transcription factor p65
Synonyms:
NFKB3 Nuclear factor NF-kappa-B p65 subunit TF65_HUMAN | v-rel reticuloendotheliosis viral oncogene homolog A isoform 1
Type:
Enzyme
Mol. Mass.:
60211.92
Organism:
Homo sapiens (Human)
Description:
Q04206
Residue:
551
  
Inhibitor
Name:
BDBM49390
Synonyms:
(6Z)-3-methyl-6-[5-(2-methylphenyl)-1,2-dihydropyrazol-3-ylidene]-1-cyclohexa-2,4-dienone (6Z)-3-methyl-6-[5-(o-tolyl)-3-pyrazolin-3-ylidene]cyclohexa-2,4-dien-1-one MLS000547497 cid_5405416
Type:
Small organic molecule
Emp. Form.:
C17H16N2O
Mol. Mass.:
264.3217
SMILES:
Cc1ccc(-c2cc([nH]n2)-c2ccccc2C)c(O)c1
: