Target
Transcription factor p65
Ligand
BDBM49468
Substrate
Meas. Tech.
Name: High Throughput Screen to Identify Compounds that increase expression of NF-kB in Human Neuronal Cells - Dose Response
EC50
373745±n/a nM
Citation
 PubChem, PC Name: High Throughput Screen to Identify Compounds that increase expression of NF-kB in Human Neuronal Cells - Dose Response PubChem Bioassay (2008)[AID] 
Target
Name:
Transcription factor p65
Synonyms:
NFKB3 Nuclear factor NF-kappa-B p65 subunit TF65_HUMAN | v-rel reticuloendotheliosis viral oncogene homolog A isoform 1
Type:
Enzyme
Mol. Mass.:
60211.92
Organism:
Homo sapiens (Human)
Description:
Q04206
Residue:
551
  
Inhibitor
Name:
BDBM49468
Synonyms:
5-methyl-N-(2-methyl-1,3-benzothiazol-6-yl)-2-thiophenecarboxamide MLS000566376 cid_2467706
Type:
Small organic molecule
Emp. Form.:
C14H12N2OS2
Mol. Mass.:
288.388
SMILES:
Cc1ccc(s1)C(=O)Nc1ccc2nc(C)sc2c1
: