Target
Glycoprotein 42
Ligand
BDBM50056938
Substrate
Meas. Tech.
Dose Response Confirmation for Small Molecule Inhibitors of Epstein-Barr Virus
IC50
990±n/a nM
Citation
 PubChem, PC Dose Response Confirmation for Small Molecule Inhibitors of Epstein-Barr Virus PubChem Bioassay (2008)[AID] 
Target
Name:
Glycoprotein 42
Synonyms:
BZLF2 | GP42_EBVA8
Type:
Enzyme Catalytic Domain
Mol. Mass.:
25424.12
Organism:
Human herpesvirus 4 type 2
Description:
gi_139424501
Residue:
223
  
Inhibitor
Name:
BDBM50056938
Synonyms:
2,6,7-Trihydroxy-9-methyl-xanthen-3-one NSC-66209 cid_72721
Type:
Small organic molecule
Emp. Form.:
C14H10O5
Mol. Mass.:
258.2262
SMILES:
Cc1c2cc(O)c(O)cc2oc2cc(=O)c(O)cc12
: