Target
DNA repair protein RAD51 homolog 1
Ligand
BDBM51370
Substrate
Meas. Tech.
Homologous recombination_Rad 51_dose response_2
IC50
53000±n/a nM
Citation
 PubChem, PC Homologous recombination_Rad 51_dose response_2 PubChem Bioassay (2008)[AID] 
Target
Name:
DNA repair protein RAD51 homolog 1
Synonyms:
RAD51 RAD51_HUMAN | RECA
Type:
Enzyme Catalytic Domain
Mol. Mass.:
36960.74
Organism:
Homo sapiens (Human)
Description:
gi_49168602
Residue:
339
  
Inhibitor
Name:
BDBM51370
Synonyms:
1-(2,4-dichlorophenyl)-3-(2-methylcyclohexyl)thiourea SMR000349030 | cid_4020555
Type:
Small organic molecule
Emp. Form.:
C14H18Cl2N2S
Mol. Mass.:
317.277
SMILES:
CC1CCCCC1NC(=S)Nc1ccc(Cl)cc1Cl
: