Target
DNA repair protein RAD51 homolog 1
Ligand
BDBM43851
Substrate
Meas. Tech.
Homologous recombination_Rad 51_dose response_2
IC50
53000±n/a nM
Citation
 PubChem, PC Homologous recombination_Rad 51_dose response_2 PubChem Bioassay (2008)[AID] 
Target
Name:
DNA repair protein RAD51 homolog 1
Synonyms:
RAD51 RAD51_HUMAN | RECA
Type:
Enzyme Catalytic Domain
Mol. Mass.:
36960.74
Organism:
Homo sapiens (Human)
Description:
gi_49168602
Residue:
339
  
Inhibitor
Name:
BDBM43851
Synonyms:
4-(2-furanylmethylsulfamoyl)-N-methyl-N-(thiophen-2-ylmethyl)benzamide 4-(furan-2-ylmethylsulfamoyl)-N-methyl-N-(thiophen-2-ylmethyl)benzamide MLS000760564 cid_2507180
Type:
Small organic molecule
Emp. Form.:
C18H18N2O4S2
Mol. Mass.:
390.477
SMILES:
CN(Cc1cccs1)C(=O)c1ccc(cc1)S(=O)(=O)NCc1ccco1
: