Target
E3 ubiquitin-protein ligase Mdm2
Ligand
BDBM43422
Substrate
Meas. Tech.
E3 Ligase_WT_Dose Response
EC50
1650±n/a nM
Citation
 PubChem, PC E3 Ligase_WT_Dose Response PubChem Bioassay (2008)[AID] 
Target
Name:
E3 ubiquitin-protein ligase Mdm2
Synonyms:
Double minute 2 protein E3 ubiquitin-protein ligase Mdm2 (p53-binding protein Mdm2) Human Double Minute 2 (HDM2) MDM2-MDMX p53-Binding Protein MDM2 | p53-binding protein
Type:
Oncoprotein
Mol. Mass.:
55196.54
Organism:
Homo sapiens (Human)
Description:
Q00987
Residue:
491
  
Inhibitor
Name:
BDBM43422
Synonyms:
(E)-2-cyano-3-[3-[(E)-2-cyano-3-(2-methoxyethylamino)-3-oxidanylidene-prop-1-enyl]phenyl]-N-(2-methoxyethyl)prop-2-enamide (E)-2-cyano-3-[3-[(E)-2-cyano-3-(2-methoxyethylamino)-3-oxoprop-1-enyl]phenyl]-N-(2-methoxyethyl)prop-2-enamide MLS000392155 cid_2423595
Type:
Small organic molecule
Emp. Form.:
C20H22N4O4
Mol. Mass.:
382.4131
SMILES:
COCCNC(=O)C(=C\c1cccc(\C=C(/C#N)C(=O)NCCOC)c1)\C#N
: