Target
Alkaline phosphatase, tissue-nonspecific isozyme
Ligand
BDBM46429
Substrate
Meas. Tech.
SAR assay for compounds activating TNAP in the presence of 100 mM DEA performed in a luminescence assay
EC50
5820±n/a nM
Citation
 PubChem, PC SAR assay for compounds activating TNAP in the presence of 100 mM DEA performed in a luminescence assay PubChem Bioassay (2009)[AID] 
Target
Name:
Alkaline phosphatase, tissue-nonspecific isozyme
Synonyms:
ALPL tissue-nonspecific alkaline phosphatase precursor
Type:
PROTEIN
Mol. Mass.:
57306.17
Organism:
Homo sapiens (Human)
Description:
ChEMBL_1448917
Residue:
524
  
Inhibitor
Name:
BDBM46429
Synonyms:
MLS-0070651.0001 N-(3-decylsulfanyl-1H-1,2,4-triazol-5-yl)ethanamide cid_3115146
Type:
Small organic molecule
Emp. Form.:
C14H26N4OS
Mol. Mass.:
298.447
SMILES:
CCCCCCCCCCSc1nnc(NC(C)=O)[nH]1
: