Target
Alkaline phosphatase, tissue-nonspecific isozyme
Ligand
BDBM43793
Substrate
Meas. Tech.
SAR assay for compounds activating TNAP in the presence of 100 mM DEA performed in a luminescence assay
EC50
4380±n/a nM
Citation
 PubChem, PC SAR assay for compounds activating TNAP in the presence of 100 mM DEA performed in a luminescence assay PubChem Bioassay (2009)[AID] 
Target
Name:
Alkaline phosphatase, tissue-nonspecific isozyme
Synonyms:
ALPL tissue-nonspecific alkaline phosphatase precursor
Type:
PROTEIN
Mol. Mass.:
57306.17
Organism:
Homo sapiens (Human)
Description:
ChEMBL_1448917
Residue:
524
  
Inhibitor
Name:
BDBM43793
Synonyms:
MLS-0239358.0001 N'-[1-(2,4-dimethylphenyl)pyrazolo[3,4-d]pyrimidin-4-yl]-2-furohydrazide cid_16194260
Type:
Small organic molecule
Emp. Form.:
C18H16N6O2
Mol. Mass.:
348.3586
SMILES:
Cc1ccc(c(C)c1)-n1ncc2c(NNC(=O)c3ccco3)ncnc12
: