Target
Alkaline phosphatase, tissue-nonspecific isozyme
Ligand
BDBM44800
Substrate
Meas. Tech.
SAR assay for compounds activating TNAP in the presence of 100 mM DEA performed in a luminescence assay
EC50
3340±n/a nM
Citation
 PubChem, PC SAR assay for compounds activating TNAP in the presence of 100 mM DEA performed in a luminescence assay PubChem Bioassay (2009)[AID] 
Target
Name:
Alkaline phosphatase, tissue-nonspecific isozyme
Synonyms:
ALPL tissue-nonspecific alkaline phosphatase precursor
Type:
PROTEIN
Mol. Mass.:
57306.17
Organism:
Homo sapiens (Human)
Description:
ChEMBL_1448917
Residue:
524
  
Inhibitor
Name:
BDBM44800
Synonyms:
3,3-diphenyl-N-(1H-1,2,4-triazol-5-yl)propanamide MLS000114029 cid_888108
Type:
Small organic molecule
Emp. Form.:
C17H16N4O
Mol. Mass.:
292.3351
SMILES:
O=C(CC(c1ccccc1)c1ccccc1)Nc1nnc[nH]1
: