Target
Alkaline phosphatase, tissue-nonspecific isozyme
Ligand
BDBM51416
Substrate
Meas. Tech.
SAR assay for compounds activating TNAP in the presence of 100 mM DEA performed in a luminescence assay
EC50
12400±n/a nM
Citation
 PubChem, PC SAR assay for compounds activating TNAP in the presence of 100 mM DEA performed in a luminescence assay PubChem Bioassay (2009)[AID] 
Target
Name:
Alkaline phosphatase, tissue-nonspecific isozyme
Synonyms:
ALPL tissue-nonspecific alkaline phosphatase precursor
Type:
PROTEIN
Mol. Mass.:
57306.17
Organism:
Homo sapiens (Human)
Description:
ChEMBL_1448917
Residue:
524
  
Inhibitor
Name:
BDBM51416
Synonyms:
4-(4-chloranylphenoxy)-N-(1H-1,2,4-triazol-5-yl)butanamide 4-(4-chlorophenoxy)-N-(1H-1,2,4-triazol-5-yl)butyramide cid_1565131
Type:
Small organic molecule
Emp. Form.:
C12H13ClN4O2
Mol. Mass.:
280.71
SMILES:
Clc1ccc(OCCCC(=O)Nc2nnc[nH]2)cc1
: