Target
Alkaline phosphatase, tissue-nonspecific isozyme
Ligand
BDBM51444
Substrate
Meas. Tech.
SAR assay for compounds activating TNAP in the presence of 100 mM DEA performed in a luminescence assay
EC50
12500±n/a nM
Citation
 PubChem, PC SAR assay for compounds activating TNAP in the presence of 100 mM DEA performed in a luminescence assay PubChem Bioassay (2009)[AID] 
Target
Name:
Alkaline phosphatase, tissue-nonspecific isozyme
Synonyms:
ALPL tissue-nonspecific alkaline phosphatase precursor
Type:
PROTEIN
Mol. Mass.:
57306.17
Organism:
Homo sapiens (Human)
Description:
ChEMBL_1448917
Residue:
524
  
Inhibitor
Name:
BDBM51444
Synonyms:
2-(2-methoxyphenoxy)-N-(1H-1,2,4-triazol-5-yl)acetamide MLS-0315830.0001 | cid_1084013
Type:
Small organic molecule
Emp. Form.:
C11H12N4O3
Mol. Mass.:
248.238
SMILES:
COc1ccccc1OCC(=O)Nc1nnc[nH]1
: