Target
Mucolipin-3
Ligand
BDBM46757
Substrate
Meas. Tech.
Fluorescence counterscreen assay for TRPN1 agonists: dose response cell-based high-throughput screening assay to identify agonists of the transient receptor potential channel ML3 (TRPML3)
EC50
29900±n/a nM
Citation
 PubChem, PC Fluorescence counterscreen assay for TRPN1 agonists: dose response cell-based high-throughput screening assay to identify agonists of the transient receptor potential channel ML3 (TRPML3) PubChem Bioassay (2009)[AID] 
Target
Name:
Mucolipin-3
Synonyms:
MCLN3_HUMAN MCOLN3 protein
Type:
Enzyme Catalytic Domain
Mol. Mass.:
64244.09
Organism:
Homo sapiens (Human)
Description:
Q8TDD5
Residue:
553
  
Inhibitor
Name:
BDBM46757
Synonyms:
1-(1,2,3-benzothiadiazol-5-yl)-3-phenyl-urea 1-Benzo[1,2,3]thiadiazol-5-yl-3-phenyl-urea SMR000121138 | cid_1072948
Type:
Small organic molecule
Emp. Form.:
C13H10N4OS
Mol. Mass.:
270.31
SMILES:
O=C(Nc1ccccc1)Nc1ccc2snnc2c1
: