Target
Mucolipin-3
Ligand
BDBM46758
Substrate
Meas. Tech.
Fluorescence counterscreen assay for TRPN1 agonists: dose response cell-based high-throughput screening assay to identify agonists of the transient receptor potential channel ML3 (TRPML3)
EC50
3320±n/a nM
Citation
 PubChem, PC Fluorescence counterscreen assay for TRPN1 agonists: dose response cell-based high-throughput screening assay to identify agonists of the transient receptor potential channel ML3 (TRPML3) PubChem Bioassay (2009)[AID] 
Target
Name:
Mucolipin-3
Synonyms:
MCLN3_HUMAN MCOLN3 protein
Type:
Enzyme Catalytic Domain
Mol. Mass.:
64244.09
Organism:
Homo sapiens (Human)
Description:
Q8TDD5
Residue:
553
  
Inhibitor
Name:
BDBM46758
Synonyms:
4-methyl-N-(phenylmethyl)-6-(1-piperidinyl)-2-pyrimidinamine Benzyl-(4-methyl-6-piperidin-1-yl-pyrimidin-2-yl)-amine N-benzyl-4-methyl-6-piperidin-1-ylpyrimidin-2-amine benzyl-(4-methyl-6-piperidino-pyrimidin-2-yl)amine | cid_950649
Type:
Small organic molecule
Emp. Form.:
C17H22N4
Mol. Mass.:
282.3834
SMILES:
Cc1cc(nc(NCc2ccccc2)n1)N1CCCCC1
: