Target
Ion channel NompC
Ligand
BDBM46872
Substrate
Meas. Tech.
Fluorescence counterscreen assay for TRPML3 agonists: dose response cell-based high-throughput screening assay to identify agonists of the transient receptor potential channel N1 (TRPN1)
EC50
29900±n/a nM
Citation
 PubChem, PC Fluorescence counterscreen assay for TRPML3 agonists: dose response cell-based high-throughput screening assay to identify agonists of the transient receptor potential channel N1 (TRPN1) PubChem Bioassay (2009)[AID] 
Target
Name:
Ion channel NompC
Synonyms:
transient receptor potential cation channel, subfamily N, member 1
Type:
Enzyme Catalytic Domain
Mol. Mass.:
175824.78
Organism:
Danio rerio
Description:
Q7T1G6
Residue:
1614
  
Inhibitor
Name:
BDBM46872
Synonyms:
1-(4-methylphenyl)sulfonyl-4-[3-methyl-1-[[4-(trifluoromethyl)phenyl]methoxy]butan-2-yl]-1,4-diazepan-5-one MLS000518548 cid_6098115
Type:
Small organic molecule
Emp. Form.:
C25H31F3N2O4S
Mol. Mass.:
512.585
SMILES:
CC(C)C(COCc1ccc(cc1)C(F)(F)F)N1CCN(CCC1=O)S(=O)(=O)c1ccc(C)cc1
: