Target
Ion channel NompC
Ligand
BDBM46886
Substrate
Meas. Tech.
Fluorescence counterscreen assay for TRPML3 agonists: dose response cell-based high-throughput screening assay to identify agonists of the transient receptor potential channel N1 (TRPN1)
EC50
29900±n/a nM
Citation
 PubChem, PC Fluorescence counterscreen assay for TRPML3 agonists: dose response cell-based high-throughput screening assay to identify agonists of the transient receptor potential channel N1 (TRPN1) PubChem Bioassay (2009)[AID] 
Target
Name:
Ion channel NompC
Synonyms:
transient receptor potential cation channel, subfamily N, member 1
Type:
Enzyme Catalytic Domain
Mol. Mass.:
175824.78
Organism:
Danio rerio
Description:
Q7T1G6
Residue:
1614
  
Inhibitor
Name:
BDBM46886
Synonyms:
4-(3,4-dihydro-1(2H)-quinolinylcarbonyl)-N,N-dipropylbenzenesulfonamide 4-(3,4-dihydro-2H-quinoline-1-carbonyl)-N,N-dipropyl-benzenesulfonamide 4-[3,4-dihydro-2H-quinolin-1-yl(oxo)methyl]-N,N-dipropylbenzenesulfonamide SMR000135962 | cid_569100
Type:
Small organic molecule
Emp. Form.:
C22H28N2O3S
Mol. Mass.:
400.534
SMILES:
CCCN(CCC)S(=O)(=O)c1ccc(cc1)C(=O)N1CCCc2ccccc12
: