Target
Ion channel NompC
Ligand
BDBM46894
Substrate
Meas. Tech.
Fluorescence counterscreen assay for TRPML3 agonists: dose response cell-based high-throughput screening assay to identify agonists of the transient receptor potential channel N1 (TRPN1)
EC50
29900±n/a nM
Citation
 PubChem, PC Fluorescence counterscreen assay for TRPML3 agonists: dose response cell-based high-throughput screening assay to identify agonists of the transient receptor potential channel N1 (TRPN1) PubChem Bioassay (2009)[AID] 
Target
Name:
Ion channel NompC
Synonyms:
transient receptor potential cation channel, subfamily N, member 1
Type:
Enzyme Catalytic Domain
Mol. Mass.:
175824.78
Organism:
Danio rerio
Description:
Q7T1G6
Residue:
1614
  
Inhibitor
Name:
BDBM46894
Synonyms:
4-(benzenesulfonylmethyl)-6-chloro-2-phenylpyrimidine 4-chloranyl-2-phenyl-6-(phenylsulfonylmethyl)pyrimidine MLS000326382 cid_1471761
Type:
Small organic molecule
Emp. Form.:
C17H13ClN2O2S
Mol. Mass.:
344.815
SMILES:
Clc1cc(CS(=O)(=O)c2ccccc2)nc(n1)-c1ccccc1
: