Target
Ion channel NompC
Ligand
BDBM46903
Substrate
Meas. Tech.
Fluorescence counterscreen assay for TRPML3 agonists: dose response cell-based high-throughput screening assay to identify agonists of the transient receptor potential channel N1 (TRPN1)
EC50
29900±n/a nM
Citation
 PubChem, PC Fluorescence counterscreen assay for TRPML3 agonists: dose response cell-based high-throughput screening assay to identify agonists of the transient receptor potential channel N1 (TRPN1) PubChem Bioassay (2009)[AID] 
Target
Name:
Ion channel NompC
Synonyms:
transient receptor potential cation channel, subfamily N, member 1
Type:
Enzyme Catalytic Domain
Mol. Mass.:
175824.78
Organism:
Danio rerio
Description:
Q7T1G6
Residue:
1614
  
Inhibitor
Name:
BDBM46903
Synonyms:
1-[(1,3-benzothiazol-2-ylthio)acetyl]-6-methoxy-2,2,4-trimethyl-1,2,3,4-tetrahydroquinoline 2-(1,3-benzothiazol-2-ylthio)-1-(6-methoxy-2,2,4-trimethyl-3,4-dihydroquinolin-1-yl)ethanone SMR000196675 | cid_2918857
Type:
Small organic molecule
Emp. Form.:
C22H24N2O2S2
Mol. Mass.:
412.568
SMILES:
COc1ccc2N(C(=O)CSc3nc4ccccc4s3)C(C)(C)CC(C)c2c1
: