Target
Ion channel NompC
Ligand
BDBM46959
Substrate
Meas. Tech.
Fluorescence counterscreen assay for TRPML3 agonists: dose response cell-based high-throughput screening assay to identify agonists of the transient receptor potential channel N1 (TRPN1)
EC50
29900±n/a nM
Citation
 PubChem, PC Fluorescence counterscreen assay for TRPML3 agonists: dose response cell-based high-throughput screening assay to identify agonists of the transient receptor potential channel N1 (TRPN1) PubChem Bioassay (2009)[AID] 
Target
Name:
Ion channel NompC
Synonyms:
transient receptor potential cation channel, subfamily N, member 1
Type:
Enzyme Catalytic Domain
Mol. Mass.:
175824.78
Organism:
Danio rerio
Description:
Q7T1G6
Residue:
1614
  
Inhibitor
Name:
BDBM46959
Synonyms:
6-ethoxy-2,2,4-trimethyl-1-(4-methylphenyl)sulfonyl-quinoline 6-ethoxy-2,2,4-trimethyl-1-tosyl-quinoline SMR000277762 | cid_1069778
Type:
Small organic molecule
Emp. Form.:
C21H25NO3S
Mol. Mass.:
371.493
SMILES:
CCOc1ccc2N(C(C)(C)C=C(C)c2c1)S(=O)(=O)c1ccc(C)cc1
: