Target
Ion channel NompC
Ligand
BDBM46964
Substrate
Meas. Tech.
Fluorescence counterscreen assay for TRPML3 agonists: dose response cell-based high-throughput screening assay to identify agonists of the transient receptor potential channel N1 (TRPN1)
EC50
11300±n/a nM
Citation
 PubChem, PC Fluorescence counterscreen assay for TRPML3 agonists: dose response cell-based high-throughput screening assay to identify agonists of the transient receptor potential channel N1 (TRPN1) PubChem Bioassay (2009)[AID] 
Target
Name:
Ion channel NompC
Synonyms:
transient receptor potential cation channel, subfamily N, member 1
Type:
Enzyme Catalytic Domain
Mol. Mass.:
175824.78
Organism:
Danio rerio
Description:
Q7T1G6
Residue:
1614
  
Inhibitor
Name:
BDBM46964
Synonyms:
2-[[5-(2-bromophenyl)-1,3,4-oxadiazol-2-yl]methyl]-4,5-bis(chloranyl)pyridazin-3-one 2-[[5-(2-bromophenyl)-1,3,4-oxadiazol-2-yl]methyl]-4,5-dichloro-pyridazin-3-one MLS000516198 cid_2530952
Type:
Small organic molecule
Emp. Form.:
C13H7BrCl2N4O2
Mol. Mass.:
402.03
SMILES:
Clc1cnn(Cc2nnc(o2)-c2ccccc2Br)c(=O)c1Cl
: