Target
Ion channel NompC
Ligand
BDBM46979
Substrate
Meas. Tech.
Fluorescence counterscreen assay for TRPML3 agonists: dose response cell-based high-throughput screening assay to identify agonists of the transient receptor potential channel N1 (TRPN1)
EC50
29900±n/a nM
Citation
 PubChem, PC Fluorescence counterscreen assay for TRPML3 agonists: dose response cell-based high-throughput screening assay to identify agonists of the transient receptor potential channel N1 (TRPN1) PubChem Bioassay (2009)[AID] 
Target
Name:
Ion channel NompC
Synonyms:
transient receptor potential cation channel, subfamily N, member 1
Type:
Enzyme Catalytic Domain
Mol. Mass.:
175824.78
Organism:
Danio rerio
Description:
Q7T1G6
Residue:
1614
  
Inhibitor
Name:
BDBM46979
Synonyms:
1,4,10-Trioxa-7,13-diaza-cyclopentadecane-7,13-dicarbothioic acid bis-cyclohexylamide MLS000767389 N7,N13-dicyclohexyl-1,4,10-trioxa-7,13-diazacyclopentadecane-7,13-dicarbothioamide cid_3696234
Type:
Small organic molecule
Emp. Form.:
C24H44N4O3S2
Mol. Mass.:
500.761
SMILES:
S=C(NC1CCCCC1)N1CCOCCOCCN(CCOCC1)C(=S)NC1CCCCC1
: