Target
Ion channel NompC
Ligand
BDBM46994
Substrate
Meas. Tech.
Fluorescence counterscreen assay for TRPML3 agonists: dose response cell-based high-throughput screening assay to identify agonists of the transient receptor potential channel N1 (TRPN1)
EC50
29900±n/a nM
Citation
 PubChem, PC Fluorescence counterscreen assay for TRPML3 agonists: dose response cell-based high-throughput screening assay to identify agonists of the transient receptor potential channel N1 (TRPN1) PubChem Bioassay (2009)[AID] 
Target
Name:
Ion channel NompC
Synonyms:
transient receptor potential cation channel, subfamily N, member 1
Type:
Enzyme Catalytic Domain
Mol. Mass.:
175824.78
Organism:
Danio rerio
Description:
Q7T1G6
Residue:
1614
  
Inhibitor
Name:
BDBM46994
Synonyms:
MLS000850372 N-(2-piperidinophenyl)-2-thiophenesulfonamide N-[2-(1-piperidinyl)phenyl]-2-thiophenesulfonamide cid_2814040
Type:
Small organic molecule
Emp. Form.:
C15H18N2O2S2
Mol. Mass.:
322.446
SMILES:
O=S(=O)(Nc1ccccc1N1CCCCC1)c1cccs1
: