Target
dTDP-4-dehydrorhamnose 3,5-epimerase
Ligand
BDBM51494
Substrate
Meas. Tech.
Rml C and D dose-response confirmation
IC50
679±n/a nM
Citation
 PubChem, PC Rml C and D dose-response confirmation PubChem Bioassay (2009)[AID] 
Target
Name:
dTDP-4-dehydrorhamnose 3,5-epimerase
Synonyms:
RMLC_MYCTO rmlC | strM
Type:
Enzyme Catalytic Domain
Mol. Mass.:
22306.68
Organism:
Mycobacterium tuberculosis H37Rv
Description:
gi_15610601
Residue:
202
  
Inhibitor
Name:
BDBM51494
Synonyms:
7-hydroxy-4-propyl-8-(1-pyrrolidinylmethyl)-1-benzopyran-2-one 7-hydroxy-4-propyl-8-(pyrrolidinomethyl)coumarin MLS000036894 cid_5389391
Type:
Small organic molecule
Emp. Form.:
C17H21NO3
Mol. Mass.:
287.3535
SMILES:
CCCc1cc(=O)oc2c(CN3CCCC3)c(O)ccc12
: