Target
Regulator of G-protein signaling 4
Ligand
BDBM40034
Substrate
Meas. Tech.
Dose response, multiplexed high-throughput screen for small molecule regulators of RGS family protein interactions, specifically RGS4-Galphao.
EC50
30000±n/a nM
Citation
 PubChem, PC Dose response, multiplexed high-throughput screen for small molecule regulators of RGS family protein interactions, specifically RGS4-Galphao. PubChem Bioassay (2009)[AID] 
Target
Name:
Regulator of G-protein signaling 4
Synonyms:
RGP4 RGS4_HUMAN | Regulator of G-protein signaling 4 (RGS4)
Type:
Enzyme
Mol. Mass.:
23263.51
Organism:
Homo sapiens (Human)
Description:
P49798
Residue:
205
  
Inhibitor
Name:
BDBM40034
Synonyms:
MLS000093573 N-(4-methyl-3-oxidanylidene-1,4-benzothiazin-6-yl)-4-piperidin-1-yl-piperidine-1-carboxamide N-(4-methyl-3-oxo-1,4-benzothiazin-6-yl)-4-piperidin-1-ylpiperidine-1-carboxamide SMR000029191 | cid_3241667
Type:
Small organic molecule
Emp. Form.:
C20H28N4O2S
Mol. Mass.:
388.527
SMILES:
CN1C(=O)CSc2ccc(NC(=O)N3CCC(CC3)N3CCCCC3)cc12
: