Target
Regulator of G-protein signaling 4
Ligand
BDBM47732
Substrate
Meas. Tech.
Dose response, multiplexed high-throughput screen for small molecule regulators of RGS family protein interactions, specifically RGS4-Galphao.
EC50
30000±n/a nM
Citation
 PubChem, PC Dose response, multiplexed high-throughput screen for small molecule regulators of RGS family protein interactions, specifically RGS4-Galphao. PubChem Bioassay (2009)[AID] 
Target
Name:
Regulator of G-protein signaling 4
Synonyms:
RGP4 RGS4_HUMAN | Regulator of G-protein signaling 4 (RGS4)
Type:
Enzyme
Mol. Mass.:
23263.51
Organism:
Homo sapiens (Human)
Description:
P49798
Residue:
205
  
Inhibitor
Name:
BDBM47732
Synonyms:
2,6,7-trihydroxy-9-o-phenetyl-fluorone 9-(2-ethoxyphenyl)-2,6,7-trihydroxy-3H-xanthen-3-one 9-(2-ethoxyphenyl)-2,6,7-tris(oxidanyl)xanthen-3-one SMR000197680 | cid_2931388
Type:
Small organic molecule
Emp. Form.:
C21H16O6
Mol. Mass.:
364.3481
SMILES:
CCOc1ccccc1-c1c2cc(O)c(O)cc2oc2cc(=O)c(O)cc12
: