Target
Regulator of G-protein signaling 4
Ligand
BDBM47742
Substrate
Meas. Tech.
Dose response, multiplexed high-throughput screen for small molecule regulators of RGS family protein interactions, specifically RGS4-Galphao.
EC50
30000±n/a nM
Citation
 PubChem, PC Dose response, multiplexed high-throughput screen for small molecule regulators of RGS family protein interactions, specifically RGS4-Galphao. PubChem Bioassay (2009)[AID] 
Target
Name:
Regulator of G-protein signaling 4
Synonyms:
RGP4 RGS4_HUMAN | Regulator of G-protein signaling 4 (RGS4)
Type:
Enzyme
Mol. Mass.:
23263.51
Organism:
Homo sapiens (Human)
Description:
P49798
Residue:
205
  
Inhibitor
Name:
BDBM47742
Synonyms:
MLS000585978 N-[1-(cyclopentylcarbamoyl)cyclohexyl]-6-oxidanylidene-N-(thiophen-2-ylmethyl)-1H-pyridine-3-carboxamide N-[1-[(cyclopentylamino)-oxomethyl]cyclohexyl]-6-oxo-N-(thiophen-2-ylmethyl)-1H-pyridine-3-carboxamide SMR000207758 | cid_5200925
Type:
Small organic molecule
Emp. Form.:
C23H29N3O3S
Mol. Mass.:
427.56
SMILES:
O=C(NC1CCCC1)C1(CCCCC1)N(Cc1cccs1)C(=O)c1ccc(=O)[nH]c1
: