Target
Regulator of G-protein signaling 4
Ligand
BDBM47748
Substrate
Meas. Tech.
Dose response, multiplexed high-throughput screen for small molecule regulators of RGS family protein interactions, specifically RGS4-Galphao.
EC50
30000±n/a nM
Citation
 PubChem, PC Dose response, multiplexed high-throughput screen for small molecule regulators of RGS family protein interactions, specifically RGS4-Galphao. PubChem Bioassay (2009)[AID] 
Target
Name:
Regulator of G-protein signaling 4
Synonyms:
RGP4 RGS4_HUMAN | Regulator of G-protein signaling 4 (RGS4)
Type:
Enzyme
Mol. Mass.:
23263.51
Organism:
Homo sapiens (Human)
Description:
P49798
Residue:
205
  
Inhibitor
Name:
BDBM47748
Synonyms:
5-acetyl-2-[[5-(4-ketocyclohexa-2,5-dien-1-ylidene)-3-isoxazoline-3-carbonyl]amino]-4-methyl-thiophene-3-carboxylic acid ethyl ester MLS000586972 cid_15944756 ethyl 5-acetyl-4-methyl-2-[[5-(4-oxocyclohexa-2,5-dien-1-ylidene)-2H-1,2-oxazole-3-carbonyl]amino]thiophene-3-carboxylate | ethyl 5-ethanoyl-4-methyl-2-[[5-(4-oxidanylidenecyclohexa-2,5-dien-1-ylidene)-2H-1,2-oxazol-3-yl]carbonylamino]thiophene-3-carboxylate
Type:
Small organic molecule
Emp. Form.:
C20H18N2O6S
Mol. Mass.:
414.432
SMILES:
CCOC(=O)c1c(C)c(sc1NC(=O)c1cc(on1)-c1ccc(O)cc1)C(C)=O
: