Target
Regulator of G-protein signaling 4
Ligand
BDBM47775
Substrate
Meas. Tech.
Dose response, multiplexed high-throughput screen for small molecule regulators of RGS family protein interactions, specifically RGS4-Galphao.
EC50
30000±n/a nM
Citation
 PubChem, PC Dose response, multiplexed high-throughput screen for small molecule regulators of RGS family protein interactions, specifically RGS4-Galphao. PubChem Bioassay (2009)[AID] 
Target
Name:
Regulator of G-protein signaling 4
Synonyms:
RGP4 RGS4_HUMAN | Regulator of G-protein signaling 4 (RGS4)
Type:
Enzyme
Mol. Mass.:
23263.51
Organism:
Homo sapiens (Human)
Description:
P49798
Residue:
205
  
Inhibitor
Name:
BDBM47775
Synonyms:
MLS000621762 N-(2-chlorophenyl)-2-[3-[3-(4-methylpiperidin-1-yl)propyl]-4-oxidanylidene-quinazolin-2-yl]sulfanyl-ethanamide N-(2-chlorophenyl)-2-[[3-[3-(4-methyl-1-piperidinyl)propyl]-4-oxo-2-quinazolinyl]thio]acetamide SMR000310689 | cid_4625345
Type:
Small organic molecule
Emp. Form.:
C25H29ClN4O2S
Mol. Mass.:
485.041
SMILES:
CC1CCN(CCCn2c(SCC(=O)Nc3ccccc3Cl)nc3ccccc3c2=O)CC1
: