Target
Regulator of G-protein signaling 4
Ligand
BDBM47783
Substrate
Meas. Tech.
Dose response, multiplexed high-throughput screen for small molecule regulators of RGS family protein interactions, specifically RGS4-Galphao.
EC50
30000±n/a nM
Citation
 PubChem, PC Dose response, multiplexed high-throughput screen for small molecule regulators of RGS family protein interactions, specifically RGS4-Galphao. PubChem Bioassay (2009)[AID] 
Target
Name:
Regulator of G-protein signaling 4
Synonyms:
RGP4 RGS4_HUMAN | Regulator of G-protein signaling 4 (RGS4)
Type:
Enzyme
Mol. Mass.:
23263.51
Organism:
Homo sapiens (Human)
Description:
P49798
Residue:
205
  
Inhibitor
Name:
BDBM47783
Synonyms:
4-[(2-chloranyl-6-fluoranyl-phenyl)methylideneamino]-3-pyridin-3-yl-1H-1,2,4-triazole-5-thione 4-[(2-chloro-6-fluorobenzylidene)amino]-5-(3-pyridinyl)-4H-1,2,4-triazole-3-thiol 4-[(2-chloro-6-fluorophenyl)methylideneamino]-3-pyridin-3-yl-1H-1,2,4-triazole-5-thione SMR000271762 | cid_806179
Type:
Small organic molecule
Emp. Form.:
C14H9ClFN5S
Mol. Mass.:
333.771
SMILES:
Fc1cccc(Cl)c1C=Nn1c(n[nH]c1=S)-c1cccnc1
: