Target
Regulator of G-protein signaling 4
Ligand
BDBM47813
Substrate
Meas. Tech.
Dose response, multiplexed high-throughput screen for small molecule regulators of RGS family protein interactions, specifically RGS4-Galphao.
EC50
30000±n/a nM
Citation
 PubChem, PC Dose response, multiplexed high-throughput screen for small molecule regulators of RGS family protein interactions, specifically RGS4-Galphao. PubChem Bioassay (2009)[AID] 
Target
Name:
Regulator of G-protein signaling 4
Synonyms:
RGP4 RGS4_HUMAN | Regulator of G-protein signaling 4 (RGS4)
Type:
Enzyme
Mol. Mass.:
23263.51
Organism:
Homo sapiens (Human)
Description:
P49798
Residue:
205
  
Inhibitor
Name:
BDBM47813
Synonyms:
(3R)-2-(4-fluorophenyl)sulfonyl-3,4-dihydro-1H-isoquinoline-3-carboxylic acid MLS000777226 cid_705446
Type:
Small organic molecule
Emp. Form.:
C16H14FNO4S
Mol. Mass.:
335.35
SMILES:
OC(=O)[C@H]1Cc2ccccc2CN1S(=O)(=O)c1ccc(F)cc1
: