Target
Dual specificity protein phosphatase 3
Ligand
BDBM32102
Substrate
Meas. Tech.
Fluorescent assay for identification of compounds that inhibit VHR1
IC50
1360±n/a nM
Citation
 PubChem, PC Fluorescent assay for identification of compounds that inhibit VHR1 PubChem Bioassay (2009)[AID] 
Target
Name:
Dual specificity protein phosphatase 3
Synonyms:
DUS3_HUMAN Dual specificity protein phosphatase (VHR) Dual specificity protein phosphatase VHR Tyrosine-protein phosphatase non-receptor type 1 | VHR
Type:
Hydrolase
Mol. Mass.:
20480.58
Organism:
Homo sapiens (Human)
Description:
Residue:
185
  
Inhibitor
Name:
BDBM32102
Synonyms:
1,6-dimethylpyrimido[5,4-e][1,2,4]triazine-5,7(1H,6H)-dione 1,6-dimethylpyrimido[5,4-e][1,2,4]triazine-5,7-quinone SMR000024051 US9738628, Compound PKF118-310 | cid_66541
Type:
Small organic molecule
Emp. Form.:
C7H7N5O2
Mol. Mass.:
193.1628
SMILES:
Cn1ncnc2c1nc(=O)n(C)c2=O
: