Target
Dual specificity protein phosphatase 3
Ligand
BDBM51776
Substrate
Meas. Tech.
Fluorescent assay for identification of compounds that inhibit VHR1
IC50
3560±n/a nM
Citation
 PubChem, PC Fluorescent assay for identification of compounds that inhibit VHR1 PubChem Bioassay (2009)[AID] 
Target
Name:
Dual specificity protein phosphatase 3
Synonyms:
DUS3_HUMAN Dual specificity protein phosphatase (VHR) Dual specificity protein phosphatase VHR Tyrosine-protein phosphatase non-receptor type 1 | VHR
Type:
Hydrolase
Mol. Mass.:
20480.58
Organism:
Homo sapiens (Human)
Description:
Residue:
185
  
Inhibitor
Name:
BDBM51776
Synonyms:
MLS000683996 N-(3-carbamoyl-6-methyl-4,5,6,7-tetrahydrobenzothiophen-2-yl)carbamic acid methyl ester cid_2887176 methyl N-(3-carbamoyl-6-methyl-4,5,6,7-tetrahydro-1-benzothiophen-2-yl)carbamate | methyl [3-(aminocarbonyl)-6-methyl-4,5,6,7-tetrahydro-1-benzothien-2-yl]carbamate
Type:
Small organic molecule
Emp. Form.:
C12H16N2O3S
Mol. Mass.:
268.332
SMILES:
COC(=O)Nc1sc2CC(C)CCc2c1C(N)=O
: