Target
Dual specificity protein phosphatase 3
Ligand
BDBM43865
Substrate
Meas. Tech.
Fluorescent assay for identification of compounds that inhibit VHR1
IC50
1230±n/a nM
Citation
 PubChem, PC Fluorescent assay for identification of compounds that inhibit VHR1 PubChem Bioassay (2009)[AID] 
Target
Name:
Dual specificity protein phosphatase 3
Synonyms:
DUS3_HUMAN Dual specificity protein phosphatase (VHR) Dual specificity protein phosphatase VHR Tyrosine-protein phosphatase non-receptor type 1 | VHR
Type:
Hydrolase
Mol. Mass.:
20480.58
Organism:
Homo sapiens (Human)
Description:
Residue:
185
  
Inhibitor
Name:
BDBM43865
Synonyms:
6-formyl-4,7-dihydroxy-9-keto-5H-phenazine-1-carboxylic acid methyl ester Glycopeptide, 4 MLS000766240 cid_5351222 methyl 6-methanoyl-4,7-bis(oxidanyl)-9-oxidanylidene-5H-phenazine-1-carboxylate
Type:
Peptide
Emp. Form.:
C15H10N2O6
Mol. Mass.:
314.2497
SMILES:
COC(=O)c1ccc(O)c2nc3c(C=O)c(O)cc(O)c3nc12
: