Target
Dual specificity protein phosphatase 3
Ligand
BDBM51780
Substrate
Meas. Tech.
Fluorescent assay for identification of compounds that inhibit VHR1
IC50
1420±n/a nM
Citation
 PubChem, PC Fluorescent assay for identification of compounds that inhibit VHR1 PubChem Bioassay (2009)[AID] 
Target
Name:
Dual specificity protein phosphatase 3
Synonyms:
DUS3_HUMAN Dual specificity protein phosphatase (VHR) Dual specificity protein phosphatase VHR Tyrosine-protein phosphatase non-receptor type 1 | VHR
Type:
Hydrolase
Mol. Mass.:
20480.58
Organism:
Homo sapiens (Human)
Description:
Residue:
185
  
Inhibitor
Name:
BDBM51780
Synonyms:
5-[5-(6-Bromo-3-oxo-benzo[4,5]imidazo[2,1-b]thiazol-2-ylidenemethyl)-furan-2-yl]-2-chloro-benzoic acid 5-[5-[(7-bromo-1-keto-thiazolo[3,2-a]benzimidazol-2-ylidene)methyl]-2-furyl]-2-chloro-benzoic acid 5-[5-[(7-bromo-1-oxo-[1,3]thiazolo[3,2-a]benzimidazol-2-ylidene)methyl]furan-2-yl]-2-chlorobenzoic acid SMR000516642 | cid_3129904
Type:
Small organic molecule
Emp. Form.:
C21H10BrClN2O4S
Mol. Mass.:
501.737
SMILES:
OC(=O)c1cc(ccc1Cl)-c1ccc(C=c2sc3nc4ccc(Br)cc4n3c2=O)o1
: