Target
Dual specificity protein phosphatase 3
Ligand
BDBM51783
Substrate
Meas. Tech.
Fluorescent assay for identification of compounds that inhibit VHR1
IC50
1230±n/a nM
Citation
 PubChem, PC Fluorescent assay for identification of compounds that inhibit VHR1 PubChem Bioassay (2009)[AID] 
Target
Name:
Dual specificity protein phosphatase 3
Synonyms:
DUS3_HUMAN Dual specificity protein phosphatase (VHR) Dual specificity protein phosphatase VHR Tyrosine-protein phosphatase non-receptor type 1 | VHR
Type:
Hydrolase
Mol. Mass.:
20480.58
Organism:
Homo sapiens (Human)
Description:
Residue:
185
  
Inhibitor
Name:
BDBM51783
Synonyms:
3-[(5E)-5-[1-(2-chlorobenzyl)-2-keto-indolin-3-ylidene]-4-keto-2-thioxo-thiazolidin-3-yl]propionic acid 3-[(5E)-5-[1-[(2-chlorophenyl)methyl]-2-oxo-3-indolylidene]-4-oxo-2-sulfanylidene-3-thiazolidinyl]propanoic acid MLS001173336 cid_1570081
Type:
Small organic molecule
Emp. Form.:
C21H15ClN2O4S2
Mol. Mass.:
458.938
SMILES:
OC(=O)CCN1C(=S)S\C(C1=O)=C1\C(=O)N(Cc2ccccc2Cl)c2ccccc12
: