Target
Mitogen-activated protein kinase kinase kinase kinase 2
Ligand
BDBM51911
Substrate
Meas. Tech.
Dose Response Confirmation Screen via Multiplex HTS Assay for Inhibitors of MEK Kinase PB1 Domains, specifically MEK5 binding to MEK Kinase 2 Mutant
EC50
30000±n/a nM
Citation
 PubChem, PC Dose Response Confirmation Screen via Multiplex HTS Assay for Inhibitors of MEK Kinase PB1 Domains, specifically MEK5 binding to MEK Kinase 2 Mutant PubChem Bioassay (2009)[AID] 
Target
Name:
Mitogen-activated protein kinase kinase kinase kinase 2
Synonyms:
2.7.11.1 GC kinase Germinal center kinase MAP4K2 MEK kinase kinase 2 RAB8IP | Rab8-interacting protein
Type:
Mol. Mass.:
91551.35
Organism:
Homo sapiens (Human)
Description:
Residue:
820
  
Inhibitor
Name:
BDBM51911
Synonyms:
(4-isopropoxybenzyl)-[3-(2-methoxyphenyl)-3-(4-methoxyphenyl)propyl]amine 3-(2-methoxyphenyl)-3-(4-methoxyphenyl)-N-[(4-propan-2-yloxyphenyl)methyl]propan-1-amine SMR000539687 | cid_3730081
Type:
Small organic molecule
Emp. Form.:
C27H33NO3
Mol. Mass.:
419.5558
SMILES:
COc1ccc(cc1)C(CCNCc1ccc(OC(C)C)cc1)c1ccccc1OC
: