Target
Mitogen-activated protein kinase kinase kinase kinase 2
Ligand
BDBM51913
Substrate
Meas. Tech.
Dose Response Confirmation Screen via Multiplex HTS Assay for Inhibitors of MEK Kinase PB1 Domains, specifically MEK5 binding to MEK Kinase 2 Mutant
EC50
11220±n/a nM
Citation
 PubChem, PC Dose Response Confirmation Screen via Multiplex HTS Assay for Inhibitors of MEK Kinase PB1 Domains, specifically MEK5 binding to MEK Kinase 2 Mutant PubChem Bioassay (2009)[AID] 
Target
Name:
Mitogen-activated protein kinase kinase kinase kinase 2
Synonyms:
2.7.11.1 GC kinase Germinal center kinase MAP4K2 MEK kinase kinase 2 RAB8IP | Rab8-interacting protein
Type:
Mol. Mass.:
91551.35
Organism:
Homo sapiens (Human)
Description:
Residue:
820
  
Inhibitor
Name:
BDBM51913
Synonyms:
3-(4-chlorophenyl)-N-[2-(dipropylamino)ethyl]-1-methyl-1H-thieno[2,3-c]pyrazole-5-carboxamide 3-(4-chlorophenyl)-N-[2-(dipropylamino)ethyl]-1-methyl-thieno[2,3-c]pyrazole-5-carboxamide MLS001199353 cid_16007420
Type:
Small organic molecule
Emp. Form.:
C21H27ClN4OS
Mol. Mass.:
418.983
SMILES:
CCCN(CCC)CCNC(=O)c1cc2c(nn(C)c2s1)-c1ccc(Cl)cc1
: