Target
Mitogen-activated protein kinase kinase kinase kinase 2
Ligand
BDBM48177
Substrate
Meas. Tech.
Dose Response Confirmation via Multiplex HTS Assay for Inhibitors of MEK Kinase PB1 Domains, specifically MEK5 binding to MEK Kinase 2 Wildtype
EC50
30000±n/a nM
Citation
 PubChem, PC Dose Response Confirmation via Multiplex HTS Assay for Inhibitors of MEK Kinase PB1 Domains, specifically MEK5 binding to MEK Kinase 2 Wildtype PubChem Bioassay (2009)[AID] 
Target
Name:
Mitogen-activated protein kinase kinase kinase kinase 2
Synonyms:
2.7.11.1 GC kinase Germinal center kinase MAP4K2 MEK kinase kinase 2 RAB8IP | Rab8-interacting protein
Type:
Mol. Mass.:
91551.35
Organism:
Homo sapiens (Human)
Description:
Residue:
820
  
Inhibitor
Name:
BDBM48177
Synonyms:
MLS000106138 cid_3103803
Type:
Small organic molecule
Emp. Form.:
C27H38N4O
Mol. Mass.:
434.6168
SMILES:
CN1CCN(CC(=O)N2CCn3c4C2CCCc4c2cc(ccc32)C2CCCCC2)CC1
: