Target
Mitogen-activated protein kinase kinase kinase kinase 2
Ligand
BDBM51872
Substrate
Meas. Tech.
Dose Response Confirmation via Multiplex HTS Assay for Inhibitors of MEK Kinase PB1 Domains, specifically MEK5 binding to MEK Kinase 2 Wildtype
EC50
8710±n/a nM
Citation
 PubChem, PC Dose Response Confirmation via Multiplex HTS Assay for Inhibitors of MEK Kinase PB1 Domains, specifically MEK5 binding to MEK Kinase 2 Wildtype PubChem Bioassay (2009)[AID] 
Target
Name:
Mitogen-activated protein kinase kinase kinase kinase 2
Synonyms:
2.7.11.1 GC kinase Germinal center kinase MAP4K2 MEK kinase kinase 2 RAB8IP | Rab8-interacting protein
Type:
Mol. Mass.:
91551.35
Organism:
Homo sapiens (Human)
Description:
Residue:
820
  
Inhibitor
Name:
BDBM51872
Synonyms:
LY-LY SMR000391062 | cid_16196600
Type:
Small organic molecule
Emp. Form.:
C52H75ClN16O7
Mol. Mass.:
1071.708
SMILES:
Cl.CC(C)C[C@H](N)c1cn(nn1)[C@@H](Cc1ccc(O)cc1)C(=O)N1CCN(CC1)c1nc(NCCOCCOCCOCC#C)nc(n1)N1CCN(CC1)C(=O)[C@H](Cc1ccc(O)cc1)n1cc(nn1)[C@@H](N)CC(C)C
: