Target
Mitogen-activated protein kinase kinase kinase kinase 2
Ligand
BDBM51875
Substrate
Meas. Tech.
Dose Response Confirmation via Multiplex HTS Assay for Inhibitors of MEK Kinase PB1 Domains, specifically MEK5 binding to MEK Kinase 2 Wildtype
EC50
30000±n/a nM
Citation
 PubChem, PC Dose Response Confirmation via Multiplex HTS Assay for Inhibitors of MEK Kinase PB1 Domains, specifically MEK5 binding to MEK Kinase 2 Wildtype PubChem Bioassay (2009)[AID] 
Target
Name:
Mitogen-activated protein kinase kinase kinase kinase 2
Synonyms:
2.7.11.1 GC kinase Germinal center kinase MAP4K2 MEK kinase kinase 2 RAB8IP | Rab8-interacting protein
Type:
Mol. Mass.:
91551.35
Organism:
Homo sapiens (Human)
Description:
Residue:
820
  
Inhibitor
Name:
BDBM51875
Synonyms:
2-amino-4-[4-(4-carbomethoxybenzyl)oxyphenyl]-6-phenyl-1,4-dihydropyrimidine-5-carboxylic acid ethyl ester MLS001061287 cid_4969429 ethyl 2-azanyl-4-[4-[(4-methoxycarbonylphenyl)methoxy]phenyl]-6-phenyl-1,4-dihydropyrimidine-5-carboxylate
Type:
Small organic molecule
Emp. Form.:
C28H27N3O5
Mol. Mass.:
485.5311
SMILES:
CCOC(=O)C1C(N=C(N)N=C1c1ccccc1)c1ccc(OCc2ccc(cc2)C(=O)OC)cc1
: